{"text_format":"1","workbook":"xlsx","n_sheets":10,"sheets":["Лист1","Калькулятор ","Аркуш1","Додаток 21 \"Форма інформування\"","Продукты","Паспорт кредиту","Лист3","Лист2","Лист4","Лист5"],"not_rendered":{"charts":0,"images":0,"macros":1,"external_links":0,"defined_names":6,"comments":0,"pivot_tables":0},"unopened":[],"bounds":{"document_bytes":16777216,"sheet_cells":100000,"rows_first":2000,"rows_last":500,"rows_between":2000,"halvings":0,"cell_chars":16384,"cell_head_chars":4096},"cells_cut":0,"cells_raw":0,"read":"whole","date_system":"1900"}

{"sheet":"Лист1","index":0,"n_rows":71,"n_cols":7,"rows_kept":71,"cut":false,"hidden":true,"merged":[[69,0,69,6],[62,0,62,1],[62,3,62,5],[70,0,70,6],[63,2,63,5],[64,0,64,6],[65,0,65,6],[66,0,66,1],[66,3,66,5],[67,2,67,5],[68,0,68,1],[57,0,57,6],[58,0,58,6],[59,0,59,6],[61,0,61,6],[56,0,56,6],[45,2,45,6],[46,2,46,6],[47,2,47,6],[48,2,48,6],[49,2,49,6],[44,2,44,6],[32,0,32,1],[33,0,33,1],[35,0,35,1],[36,2,36,6],[37,2,37,6],[38,2,38,6],[39,2,39,6],[40,2,40,6],[41,2,41,6],[50,2,50,6],[52,2,52,6],[53,2,53,6],[54,2,54,6],[55,2,55,6],[51,2,51,6],[19,0,20,1],[19,2,19,3],[20,2,20,3],[21,0,21,3],[23,0,23,5],[25,6,26,6],[42,2,42,6],[43,2,43,6],[29,0,29,2],[29,4,30,6],[30,0,30,2],[31,0,31,1],[24,1,26,1],[24,2,24,3],[25,2,26,2],[25,3,26,3],[25,4,26,4],[24,4,24,6],[0,0,0,1],[1,0,1,1],[2,0,2,1],[14,0,16,5],[18,0,18,1],[18,2,18,3]]}
["Публічне акціонерне товариство \"ТАСКОМБанк\"  "]
["Україна, 01032, м. Київ, вул. С. Петлюри, 30,"]
["безкоштовний телефон: 0 (800) 503 580"]
[null,"Інформація (довідка) про кредит _____________________________:"]
[null,"Розмір кредиту:"]
[null,"Вартість товару (послуги):",null,"грн."]
[null,"Сума на поточні потреби",null,"грн."]
[null,"Сума авансу:",null,"грн."]
[null,"Страховий платiж:",null,"грн."]
[null,"Пенсійний внесок:",null,"грн."]
{"$rows_left_out":62}
{"sheet":"Калькулятор ","index":1,"n_rows":126,"n_cols":39,"rows_kept":126,"cut":false,"hidden":false,"merged":[[1,1,1,4],[23,0,26,0],[23,2,26,2],[25,10,25,11],[24,4,26,4],[24,5,26,5],[25,6,25,9],[23,4,23,15],[10,1,10,9],[19,4,19,9],[15,5,15,9],[18,5,18,9],[17,5,17,9],[13,5,13,9],[0,0,0,17],[1,6,1,9],[23,1,26,1],[23,3,26,3],[3,1,3,3],[6,1,6,3],[9,1,9,3],[20,5,20,9],[14,5,14,9],[5,1,5,3],[24,6,24,15],[25,12,25,15],[7,1,7,3],[5,6,5,7],[6,6,6,7],[7,6,7,7],[125,0,125,17],[124,0,124,17],[22,11,22,17],[22,0,22,10],[11,5,11,9],[14,13,19,15],[23,16,26,16],[23,17,26,17],[116,1,116,3],[117,1,117,3],[118,1,118,3],[119,1,119,3],[120,1,120,3]]}
[]
[null,"Кредит на купівлю нового авто HYUNDAI",null,null,null,"Кредит","Ануїтетна схема",null,null,null,"Ануїтетна схема",null,null,null,null,null,{"$f":"IF(G2=K3,1,2)","v":2}]
[null,"Умови:",null,null,null,null,null,null,null,null,"Класична схема"]
[null,"Дата надання кредиту:",null,null,"2025-07-22",null,"Сума кредиту всього: ",null,{"$f":"I6+Q12+Q17","v":100005.00000000003},"грн"]
[null,null,null,null,null,null,"Сума кредиту на КАСКО:",null,{"$f":"Q12+Q16+Q17","v":0},"грн"]
[null,"Вартість автомобіля:",null,null,333350,"грн","Сума кредиту на авто:",null,{"$f":"E6-I7","v":100005.00000000003},"грн.",{"$f":"I6/E6","v":0.3000000000000001}]
[null,"Термін користування кредитом:",null,null,84,"міс.","Сума авансу:",null,{"$f":"K7*E6","v":233344.99999999997},"грн.",{"$f":"E8","v":0.7}]
[null,"Сумма авансу:",null,null,0.7,null,"Страхова сума:",null,{"$f":"E6","v":333350},"грн."]
[null,null,null,null,null,null,null,null,null,null,null,null,null,null,null,null,null,null,null,null,null,null,null,null,null,null,null,null,null,null,null,null,"ЧП \"Актив Плюс\"",null,null,null,"Сплата комісії з кредиту","Сплата страховки 1 з кредиту","Сплата страховки 2 з кредиту"]
[null,"Номінальна процентна ставка: ",null,null,{"$f":"INDEX(Аркуш1!$C$4:$H$10,MATCH('Калькулятор '!$E$7,Аркуш1!$B$4:$B$10,0),MATCH('Калькулятор '!$E$8,Аркуш1!$C$3:$H$3,0))","v":0.1099},"річних",null,null,null,null,null,null,null,null,null,null,null,null,null,null,null,null,null,null,null,null,null,null,null,null,null,"Кредит «Вперед к мечте»","ВАТ \"АКО-Експерт\"",null,null,null,"так","ні","так"]
{"$rows_left_out":117}
{"sheet":"Аркуш1","index":2,"n_rows":10,"n_cols":9,"rows_kept":10,"cut":false,"hidden":true,"merged":[]}
[]
[null,"Термін","внесок","внесок","внесок","внесок","внесок","внесок","разова комісія"]
[null,"кредиту, міс.",0.2,0.3,0.4,0.5,0.6,0.7,"банку, %"]
[null,12,9.9900000000000003E-2,8.9899999999999994E-2,7.9899999999999999E-2,5.4899999999999997E-2,2.9899999999999999E-2,1E-4,0]
[null,24,0.1399,0.1399,0.11990000000000001,9.9900000000000003E-2,7.9899999999999999E-2,3.9899999999999998E-2,0]
[null,36,0.15490000000000001,0.15490000000000001,0.12989999999999999,0.1149,9.5899999999999999E-2,5.9900000000000002E-2,0]
[null,48,0.15989999999999999,0.15989999999999999,0.14990000000000001,0.1249,0.1099,7.9899999999999999E-2,0]
[null,60,0.16250000000000001,0.16250000000000001,0.15989999999999999,0.13389999999999999,0.11990000000000001,8.9899999999999994E-2,0]
[null,72,0.17249999999999999,0.17249999999999999,0.15989999999999999,0.13489999999999999,0.1249,9.9900000000000003E-2,0]
[null,84,0.1699,0.1699,0.15989999999999999,0.1399,0.12989999999999999,0.1099,0]
{"$rows_left_out":1}
{"sheet":"Додаток 21 \"Форма інформування\"","index":3,"n_rows":81,"n_cols":8,"rows_kept":81,"cut":false,"hidden":true,"merged":[[0,0,0,7],[73,1,73,7],[64,1,64,2],[64,4,64,6],[65,3,65,6],[66,1,66,7],[72,1,72,7],[70,1,70,2],[67,1,67,7],[68,1,68,2],[68,4,68,6],[69,3,69,6],[71,1,71,7],[49,3,49,7],[56,3,56,7],[58,1,58,7],[59,1,59,7],[60,1,60,7],[63,1,63,7],[37,3,37,7],[38,3,38,7],[39,3,39,7],[40,3,40,7],[41,3,41,7],[42,3,42,7],[54,3,54,7],[55,3,55,7],[43,3,43,7],[44,3,44,7],[45,3,45,7],[53,3,53,7],[50,3,50,7],[51,3,51,7],[52,3,52,7],[26,4,27,4],[26,7,27,7],[46,3,46,7],[30,1,30,3],[31,1,31,3],[32,1,32,2],[33,1,33,2],[30,5,31,7],[36,1,36,2],[2,1,2,2],[3,1,3,2],[15,1,17,6],[24,1,24,6],[1,1,1,3],[1,5,1,6],[61,1,61,7],[26,5,27,5],[19,1,19,2],[19,3,19,4],[34,1,34,2],[20,3,20,4],[21,3,21,4],[20,1,21,2],[22,1,22,4],[47,3,47,7],[47,2,48,2],[48,3,48,7],[25,2,27,2],[25,3,25,4],[25,5,25,7],[26,3,27,3]]}
["Інформація про умови кредитування та орієнтовну сукупну вартість кредиту"]
[null,"ПУБЛІЧНЕ АКЦІОНЕРНЕ ТОВАРИСТВО \"ТАСКОМБАНК\"  "]
[null,"Україна, 01032, м. Київ, вул. С. Петлюри, 30,"]
[null,"безкоштовний телефон: 0 (800) 503 580"]
[]
[null,null,"Розмір кредиту:"]
[null,null,"Вартість товару (послуги):",{"$f":"'Калькулятор '!E6","v":333350},"грн."]
[null,null,"Сума на поточні потреби",{"$f":"'Калькулятор '!I6","v":100005.00000000003},"грн."]
[null,null,"Сума авансу:",{"$f":"'Калькулятор '!I7","v":233344.99999999997},"грн."]
[null,null,"Страховий платiж:",{"$f":"'Калькулятор '!K29","v":0},"грн."]
{"$rows_left_out":72}
{"sheet":"Продукты","index":4,"n_rows":23,"n_cols":14,"rows_kept":23,"cut":false,"hidden":true,"merged":[]}
[]
["Назва кредитного продукту","Кредит «Вперед к мечте»","Кредит на покупку недвижимости","Кредит под залог недвижимости","Кредит под депозит","Кредит на купівлю автомобіля, що був у використанні","Овердрафт для держателей зарплатных карт","Кредитная карта VIP","Овердрафт GOLD","Кредит на навчання","Кеш-кредит \"Зручна готівка\" із послугою страхування","Лізинг нерухомості","Кредит на купівлю нового легкового автомобіля","Кредит \"Автосалон\""]
["Валюта кредиту","Гривня","Гривня","Гривня","Гривня/Долар США/Євро, відповідає валюті депозиту","Гривня","Гривня","Гривня","Гривня","Гривня","Гривня","Гривня","Гривня","Гривня"]
["Форма кредиту","Строковий кредит.\nСтроковий кредит - сума грошових коштів, що одноразово надається позичальнику на принципах безумовного повернення, строковості, платності, цільової спрямованості та забезпеченості.\nВиконання зобов’язання за кредитним договором, а саме повернення кредиту, сплата процентів та щомісячних комісій (в разі наявності) здійснюється таким чином:\n- проценти сплачуються щомісячно;\n- основний борг повертається щомісячно рівними частинами або ануїтетними платежами.","Строковий кредит.\nСтроковий кредит - сума грошових коштів, що одноразово надається позичальнику на принципах безумовного повернення, строковості, платності, цільової спрямованості та забезпеченості.\nВиконання зобов’язання за кредитним договором, а саме повернення кредиту, сплата процентів та щомісячних комісій (в разі наявності) здійснюється таким чином:\n- проценти сплачуються щомісячно;\n- основний борг повертається щомісячно рівними частинами або ануїтетними платежами.","Строковий кредит/кредитна лінія\nСтроковий кредит - сума грошових коштів, що одноразово надається позичальнику на принципах безумовного повернення, строковості, платності, цільової спрямованості та забезпеченості.\nКредитна лінія – кредитна угода, відповідно до якої протягом передбаченого договором терміну банк виділяє позичальнику кредит у межах узгодженої суми (ліміту кредитування) на умовах, що відрізняються від умов одноразового надання кредиту.","Строковий кредит/кредитна лінія\nСтроковий кредит - сума грошових коштів, що одноразово надається позичальнику на принципах безумовного повернення, строковості, платності, цільової спрямованості та забезпеченості.\nКредитна лінія – кредитна угода, відповідно до якої протягом передбаченого договором терміну банк виділяє позичальнику кредит у межах узгодженої суми (ліміту кредитування) на умовах, що відрізняються від умов одноразового надання кредиту.","Строковий кредит.\nСтроковий кредит - сума грошових коштів, що одноразово надається позичальнику на принципах безумовного повернення, строковості, платності, цільової спрямованості та забезпеченості.\nВиконання зобов’язання за кредитним договором, а саме повернення кредиту, сплата процентів та щомісячних комісій (в разі наявності) здійснюється таким чином:\n- проценти сплачуються щомісячно;\n- основний борг повертається щомісячно рівними частинами або ануїтетними платежами.","Кредит у формі овердрафту","Кредит у формі овердрафту","Кредит у формі овердрафту","Картковий кредит","Кредит готівкою","Лізинг \nЛізинг — підприємницька діяльність, спрямована на інвестування власних чи залучених фінансових коштів, яка полягає в наданні лізингодавцем у виключне користування на визначений строк лізингоодержувачу майна.","Строковий кредит.\nСтроковий кредит - сума грошових коштів, що одноразово надається позичальнику на принципах безумовного повернення, строковості, платності, цільової спрямованості та забезпеченості.\nВиконання зобов’язання за кредитним договором, а саме повернення кредиту, сплата процентів та щомісячних комісій (в разі наявності) здійснюється таким чином:\n- проценти сплачуються щомісячно;\n- основний борг повертається щомісячно рівними частинами або ануїтетними платежами.","Строковий кредит.\nСтроковий кредит - сума грошових коштів, що одноразово надається позичальнику на принципах безумовного повернення, строковості, платності, цільової спрямованості та забезпеченості.\nВиконання зобов’язання за кредитним договором, а саме повернення кредиту, сплата процентів та щомісячних комісій (в разі наявності) здійснюється таким чином:\n- проценти сплачуються щомісячно;\n- основний борг повертається щомісячно рівними частинами або ануїтетними платежами."]
["Мета кредиту","Кредит надається безготівково на оплату товарів чи послуг та оплату супутніх послуг, які пов’язані з отриманням, обслуговуванням і погашенням кредиту.","Кредит надається безготівково на оплату товарів чи послуг та оплату супутніх послуг, які пов’язані з отриманням, обслуговуванням і погашенням кредиту.","Кредит надається безготівково на оплату товарів чи послуг та оплату супутніх послуг, які пов’язані з отриманням, обслуговуванням і погашенням кредиту.","Кредит надається безготівково на оплату товарів чи послуг та оплату супутніх послуг, які пов’язані з отриманням, обслуговуванням і погашенням кредиту.","Кредит надається  на придбання нового автомобіля та на споживчі потреби","Кредит надається безготівково на оплату товарів чи послуг та оплату супутніх послуг, які пов’язані з отриманням, обслуговуванням і погашенням кредиту.","Кредит надається безготівково на оплату товарів чи послуг та оплату супутніх послуг, які пов’язані з отриманням, обслуговуванням і погашенням кредиту.","Кредит надається безготівково на оплату товарів чи послуг та оплату супутніх послуг, які пов’язані з отриманням, обслуговуванням і погашенням кредиту.","Кредит надається безготівково на оплату товарів чи послуг та оплату супутніх послуг, які пов’язані з отриманням, обслуговуванням і погашенням кредиту.","Споживчі потреби","Фінансування надається безготівково на оплату товарів чи послуг та оплату супутніх послуг, які пов’язані з отриманням, обслуговуванням і погашенням фінансування.","Кредит надається безготівково на оплату товарів чи послуг та оплату супутніх послуг, які пов’язані з отриманням, обслуговуванням і погашенням кредиту.","Кредит надається безготівково на оплату товарів чи послуг та оплату супутніх послуг, які пов’язані з отриманням, обслуговуванням і погашенням кредиту."]
["Тип процентної ставки","Фіксована","Фіксована","Фіксована","Фіксована","Фіксована","Фіксована","Фіксована","Фіксована","Фіксована","Фіксована","Фіксована","Фіксована","Фіксована"]
["Плата за користування кредитом","Від 14% річних","24% річних - ануїтетна схема погашення; 24% - стандартна схема погашення","24% річних - ануїтетна схема погашення; 24% - стандартна схема погашення","Ставка по депозиту + 2,7%","Від 16,99%","36% річних","0,001% річних","35% річних","36% річних","19,99% річних","24% річних","Від 19,9%","Від 0,001%"]
["Страховий тариф","3% від залишку заборгованості по кредиту щорічно","0,5% - страхування життя, 0,3% - страхування предмету застави","0,5% - страхування життя, 0,3% - страхування предмету застави","-","2,99% - страхування життя, від 5,99% - страхування КАСКО, від 400 грн. - страхування ОСАГО","-","-","-","-","6% на рік, оплачується при оформленні кредиту одразу на весь строк кредиту шляхом перерахування на рахунок страхової компанії з Позичковго рахунку","1% - страхування життя, 0,3% - страхування предмету лізингу","2,99% - страхування життя, від 6,0% - страхування КАСКО, від 400 грн. - страхування ОСАГО","2,99% - страхування життя, від 6,0% - страхування КАСКО, від 400 грн. - страхування ОСАГО"]
["Строки кредитування","від 12 до 60 місяців","До 10 років","До 10 років","Строк депозиту - 32 дні","Від 3 міс. до 84 міс.","12 місяців","12 місяців","12 місяців","5 місяців","12/24/36 місяців","До 10 років","Від 3 міс. до 84 міс.","Від 3 міс. до 84 міс."]
["Суми кредитування","від 100 до 400 тис. грн.","Від 25 тис. до 2 млн. грн.","Від 25 тис. до 2 млн. грн., але не більше 50% вартості житла, яке надається в заставу",null,"Від 50 тис. до 800 тис. грн.","Від 500 грн. до 15 тис. грн. (але не більше 50% заробітної платні)","До 500 тис. грн.","До 50 тис. грн.","До 20 тис. грн.","Від 2 000 до 50 000 грн. з врахуванням суми страхового платежу","Від 25 тис. до 2 млн. грн.","Від 50 тис. до 800 тис. грн.","Від 50 тис. до 800 тис. грн."]
{"$rows_left_out":14}
{"sheet":"Паспорт кредиту","index":5,"n_rows":89,"n_cols":2,"rows_kept":89,"cut":false,"hidden":true,"merged":[[87,0,87,1],[88,0,88,1],[66,1,67,1],[8,0,9,0],[11,0,13,0],[16,0,16,1],[22,0,22,1],[31,0,31,1],[56,0,56,1],[42,0,43,0],[17,1,21,1],[79,0,79,1],[84,0,84,1],[85,0,85,1],[36,0,37,0],[38,0,39,0],[1,0,1,1],[2,0,2,1],[3,0,3,1],[5,0,5,1],[6,0,7,0],[4,0,4,1],[40,0,41,0],[58,0,58,1],[63,0,63,1],[65,0,65,1],[46,0,47,0],[75,0,75,1],[76,0,76,1],[78,0,78,1],[57,0,57,1],[48,0,49,0],[66,0,67,0],[74,0,74,1]]}
[null,"Версія 010921.1"]
["Паспорт споживчого кредиту за продуктом \"Кредит на купівлю нового автомобіля за програмою \"Авто Драйв\""]
["Інформація щодо умов кредитування Банку згідно вимог Закону України \"Про споживче кредитування\"№1734-VIII від 15.11.16 р."]
["(Стандартизована форма)"]
[{"$f":"'Калькулятор '!L23","v":"Ануїтетна схема"}]
["1. Інформація та контактні дані кредитодавця"]
["Найменування кредитодавця та його структурного або відокремленого підрозділу, в якому поширюється інформація","АТ «ТАСКОМБАНК»"]
[null,"_________________(вказати назву відділення)"]
["Місцезнаходження кредитодавця та адреса структурного або відокремленого підрозділу, в якому поширюється інформація","01032, м. Київ, вул. Симона Петлюри, 30"]
[null,"_________________(вказати адресу відділення)"]
{"$rows_left_out":80}
{"sheet":"Лист3","index":6,"n_rows":0,"n_cols":0,"rows_kept":0,"cut":false,"hidden":true,"merged":[]}

{"sheet":"Лист2","index":7,"n_rows":0,"n_cols":0,"rows_kept":0,"cut":false,"hidden":true,"merged":[]}

{"sheet":"Лист4","index":8,"n_rows":0,"n_cols":0,"rows_kept":0,"cut":false,"hidden":true,"merged":[]}

{"sheet":"Лист5","index":9,"n_rows":0,"n_cols":0,"rows_kept":0,"cut":false,"hidden":true,"merged":[]}